Details

    • Type: Feature Request
    • Status: Closed
    • Priority: L3 - Default
    • Resolution: Fixed
    • Affects Version/s: None
    • Fix Version/s: 7.10.0, 7.10.0-alpha2
    • Component/s: engine
    • Labels:

      Description

      MariaDB 10.3 is supported. There it necessary to investigate the following exception that occurs with MariaDB 10.3

      15:19:38 Tests run: 16, Failures: 1, Errors: 0, Skipped: 0, Time elapsed: 0.707 sec <<< FAILURE! - in org.camunda.bpm.engine.test.bpmn.deployment.BpmnDeploymentTest
      15:19:38 testPartialChangesDeployChangedOnly(org.camunda.bpm.engine.test.bpmn.deployment.BpmnDeploymentTest)  Time elapsed: 0.061 sec  <<< FAILURE!
      15:19:38 junit.framework.AssertionFailedError: expected:<1> but was:<2>
      15:19:38 	at junit.framework.Assert.fail(Assert.java:57)
      15:19:38 	at junit.framework.Assert.failNotEquals(Assert.java:329)
      15:19:38 	at junit.framework.Assert.assertEquals(Assert.java:78)
      15:19:38 	at junit.framework.Assert.assertEquals(Assert.java:159)
      15:19:38 	at junit.framework.Assert.assertEquals(Assert.java:166)
      15:19:38 	at junit.framework.TestCase.assertEquals(TestCase.java:324)
      15:19:38 	at org.camunda.bpm.engine.test.bpmn.deployment.BpmnDeploymentTest.testPartialChangesDeployChangedOnly(BpmnDeploymentTest.java:189)
      15:19:38 	at sun.reflect.NativeMethodAccessorImpl.invoke0(Native Method)
      15:19:38 	at sun.reflect.NativeMethodAccessorImpl.invoke(NativeMethodAccessorImpl.java:62)
      15:19:38 	at sun.reflect.DelegatingMethodAccessorImpl.invoke(DelegatingMethodAccessorImpl.java:43)
      15:19:38 	at java.lang.reflect.Method.invoke(Method.java:498)
      15:19:38 	at junit.framework.TestCase.runTest(TestCase.java:176)
      15:19:38 	at junit.framework.TestCase.runBare(TestCase.java:141)
      15:19:38 	at org.camunda.bpm.engine.impl.test.AbstractProcessEngineTestCase.runBare(AbstractProcessEngineTestCase.java:111)
      15:19:38 	at junit.framework.TestResult$1.protect(TestResult.java:122)
      15:19:38 	at junit.framework.TestResult.runProtected(TestResult.java:142)
      15:19:38 	at junit.framework.TestResult.run(TestResult.java:125)
      15:19:38 	at junit.framework.TestCase.run(TestCase.java:129)
      15:19:38 	at junit.framework.TestSuite.runTest(TestSuite.java:255)
      15:19:38 	at junit.framework.TestSuite.run(TestSuite.java:250)
      15:19:38 	at org.junit.internal.runners.JUnit38ClassRunner.run(JUnit38ClassRunner.java:84)
      15:19:38 	at org.apache.maven.surefire.junit4.JUnit4Provider.execute(JUnit4Provider.java:264)
      15:19:38 	at org.apache.maven.surefire.junit4.JUnit4Provider.executeTestSet(JUnit4Provider.java:153)
      15:19:38 	at org.apache.maven.surefire.junit4.JUnit4Provider.invoke(JUnit4Provider.java:124)
      15:19:38 	at org.apache.maven.surefire.booter.ForkedBooter.invokeProviderInSameClassLoader(ForkedBooter.java:200)
      15:19:38 	at org.apache.maven.surefire.booter.ForkedBooter.runSuitesInProcess(ForkedBooter.java:153)
      15:19:38 	at org.apache.maven.surefire.booter.ForkedBooter.main(ForkedBooter.java:103)
      

        Activity

        roman.smirnov Smirnov Roman created issue -
        roman.smirnov Smirnov Roman made changes -
        Field Original Value New Value
        Description MariaDB 10.3 is supported.
        MariaDB 10.3 is supported. There it necessary to investigate the following exception that occurs with MariaDB 10.3

        {code}
        15:19:38 Tests run: 16, Failures: 1, Errors: 0, Skipped: 0, Time elapsed: 0.707 sec <<< FAILURE! - in org.camunda.bpm.engine.test.bpmn.deployment.BpmnDeploymentTest
        15:19:38 testPartialChangesDeployChangedOnly(org.camunda.bpm.engine.test.bpmn.deployment.BpmnDeploymentTest) Time elapsed: 0.061 sec <<< FAILURE!
        15:19:38 junit.framework.AssertionFailedError: expected:<1> but was:<2>
        15:19:38 at junit.framework.Assert.fail(Assert.java:57)
        15:19:38 at junit.framework.Assert.failNotEquals(Assert.java:329)
        15:19:38 at junit.framework.Assert.assertEquals(Assert.java:78)
        15:19:38 at junit.framework.Assert.assertEquals(Assert.java:159)
        15:19:38 at junit.framework.Assert.assertEquals(Assert.java:166)
        15:19:38 at junit.framework.TestCase.assertEquals(TestCase.java:324)
        15:19:38 at org.camunda.bpm.engine.test.bpmn.deployment.BpmnDeploymentTest.testPartialChangesDeployChangedOnly(BpmnDeploymentTest.java:189)
        15:19:38 at sun.reflect.NativeMethodAccessorImpl.invoke0(Native Method)
        15:19:38 at sun.reflect.NativeMethodAccessorImpl.invoke(NativeMethodAccessorImpl.java:62)
        15:19:38 at sun.reflect.DelegatingMethodAccessorImpl.invoke(DelegatingMethodAccessorImpl.java:43)
        15:19:38 at java.lang.reflect.Method.invoke(Method.java:498)
        15:19:38 at junit.framework.TestCase.runTest(TestCase.java:176)
        15:19:38 at junit.framework.TestCase.runBare(TestCase.java:141)
        15:19:38 at org.camunda.bpm.engine.impl.test.AbstractProcessEngineTestCase.runBare(AbstractProcessEngineTestCase.java:111)
        15:19:38 at junit.framework.TestResult$1.protect(TestResult.java:122)
        15:19:38 at junit.framework.TestResult.runProtected(TestResult.java:142)
        15:19:38 at junit.framework.TestResult.run(TestResult.java:125)
        15:19:38 at junit.framework.TestCase.run(TestCase.java:129)
        15:19:38 at junit.framework.TestSuite.runTest(TestSuite.java:255)
        15:19:38 at junit.framework.TestSuite.run(TestSuite.java:250)
        15:19:38 at org.junit.internal.runners.JUnit38ClassRunner.run(JUnit38ClassRunner.java:84)
        15:19:38 at org.apache.maven.surefire.junit4.JUnit4Provider.execute(JUnit4Provider.java:264)
        15:19:38 at org.apache.maven.surefire.junit4.JUnit4Provider.executeTestSet(JUnit4Provider.java:153)
        15:19:38 at org.apache.maven.surefire.junit4.JUnit4Provider.invoke(JUnit4Provider.java:124)
        15:19:38 at org.apache.maven.surefire.booter.ForkedBooter.invokeProviderInSameClassLoader(ForkedBooter.java:200)
        15:19:38 at org.apache.maven.surefire.booter.ForkedBooter.runSuitesInProcess(ForkedBooter.java:153)
        15:19:38 at org.apache.maven.surefire.booter.ForkedBooter.main(ForkedBooter.java:103)
        {code}
        andreas.tollschein Andreas Tollschein made changes -
        Link This issue is depended on by SUPPORT-4508 [ SUPPORT-4508 ]
        roman.smirnov Smirnov Roman made changes -
        Rank Ranked higher
        roman.smirnov Smirnov Roman made changes -
        Assignee Nikola Koevski [ nikola.koevski ] Yana Vasileva [ yana.vasileva ]
        yana.vasileva Yana Vasileva made changes -
        Rank Ranked lower
        yana.vasileva Yana Vasileva made changes -
        Status Open [ 1 ] In Progress [ 3 ]
        yana.vasileva Yana Vasileva made changes -
        Link This issue is depended on by SRE-193 [ SRE-193 ]
        yana.vasileva Yana Vasileva made changes -
        Status In Progress [ 3 ] Resolved [ 5 ]
        Original Estimate 0 minutes [ 0 ]
        Remaining Estimate 0 minutes [ 0 ]
        Assignee Yana Vasileva [ yana.vasileva ] Nikola Koevski [ nikola.koevski ]
        Resolution Fixed [ 1 ]
        nikola.koevski Nikola Koevski made changes -
        Status Resolved [ 5 ] Closed [ 6 ]
        nikola.koevski Nikola Koevski made changes -
        Fix Version/s 7.10.0-alpha2 [ 15327 ]
        thorben.lindhauer Thorben Lindhauer made changes -
        Workflow camunda BPM [ 51482 ] Backup_camunda BPM [ 63896 ]

          People

          • Assignee:
            nikola.koevski Nikola Koevski
            Reporter:
            roman.smirnov Smirnov Roman
          • Votes:
            0 Vote for this issue
            Watchers:
            2 Start watching this issue

            Dates

            • Created:
              Updated:
              Resolved:

              Development